{"text_format":"2","workbook":"xlsx","n_sheets":4,"sheets":["Grading form","Criteria","Sheet4","Sheet5"],"not_rendered":{"charts":0,"images":3,"macros":0,"external_links":0,"defined_names":1,"comments":0,"pivot_tables":0},"unopened":[],"bounds":{"document_bytes":16777216,"sheet_cells":100000,"run_cost":"one","rows_first":2000,"rows_last":500,"rows_between":2000,"halvings":0,"cell_chars":16384,"cell_head_chars":4096},"cells_cut":0,"cells_raw":0,"read":"whole","date_system":"1900"}

{"sheet":"Grading form","index":0,"n_rows":30,"n_cols":6,"rows_kept":30,"cut":false,"hidden":false,"merged":[[2,0,2,3],[3,0,3,1],[3,2,3,3],[4,0,4,1],[4,2,4,3],[5,0,5,1],[5,2,5,3],[6,0,6,1],[6,2,6,3],[7,0,7,1],[7,2,7,3],[8,0,8,1],[8,2,8,3],[9,0,9,1],[9,2,9,3],[10,0,10,1],[10,2,10,3],[11,0,11,1],[11,2,11,3],[29,4,29,5],[0,1,1,4],[17,0,19,1],[17,2,19,3]]}
[null,"Australian Taekwondo Chungdokwan Grading Application Form"]
[]
["Please complete the below information, print and sign the form and give it to your instructor."]
["Class you attend most regularly",null,"North Sydney Girls High"]
["Full Name"]
["Membership number\n(on the back of your attendance card)",null,{"$f":"IF(C4=\"north sydney girls high\",\"n/a\",)","v":"n/a"}]
["Date of Birth"]
["Submission date of grading application"]
["Present Grade",null,"Yellow Belt (8th kup)"]
["Date of last promotion"]
["Number of competitions entered",null,0]
["Name of instructor",null,{"$f":"IF(C4=\"North Sydney Girls High\",\"ZiChuan Lim/Andy Pham\",IF(C4=\"Mosman\",\"Stephen Suh\",IF(C4=\"Beacon Hill\",\"Stephen Suh\",IF(C4=\"Manly\",\"Stephen Suh\",IF(C4=\"Chatswood Tuesday\",\"Sydney Yang\",IF(C4=\"Chatswood Saturday\",\"Stephen Suh/ZiChuan Lim\",\"ZiChuan Lim\"))))))","v":"ZiChuan Lim/Andy Pham"}]
[]
["I hereby submit the application together with the fee for a test conducted by the examiner(s)."]
["I certify that the above statements are true"]
[]
[]
[]
[]
[]
["Signature of instructor",null,"Signature of applicant"]
[{"$nulls":5},"Instructor to complete"]
["Time since last grading (months)",{"$f":"(TODAY()-C10)/30","v":1447.46666666667},"Target number of classes",{"$f":"VLOOKUP(C9,Sheet4!A:J,10,FALSE)","v":83},"Actual number of classes (since last grading)"]
[]
["Examiner use only:"]
["Basic Moves","Patterns","Sparring","Power","Self Defence (One step sparring and grabs)","Competitions entered"]
[{"$f":"VLOOKUP(C9,Sheet4!A:B,2,FALSE)","v":"Front Kick\nTurning Kick\nSide Kick\nAxe Kick\nBack Kick\nReverse Turning Kick"},{"$f":"IF(C4=\"North Sydney Girls High\",VLOOKUP(C9,Sheet4!A:E,5,FALSE),IF(C4=\"Chatswood Tuesday\",VLOOKUP(C9,Sheet4!A:D,4,FALSE),IF(C4=\"Chatswood Thursday\",VLOOKUP(C9,Sheet4!A:D,4,FALSE),VLOOKUP(C9,Sheet4!A:C,3,FALSE))))","v":"Dan gun (yellow belt pattern)\nChon ji\nTaeguk 1\n"},{"$f":"VLOOKUP(C9,Sheet4!A:G,7,FALSE)","v":"N/A"},{"$f":"VLOOKUP(C9,Sheet4!A:H,8,FALSE)","v":"N/A"},{"$f":"VLOOKUP(C9,Sheet4!A:F,6,FALSE)","v":0},{"$f":"C11","v":0}]
[]
["Comments"]
["Result",null,null,"Examiner's signature"]

{"sheet":"Criteria","index":1,"n_rows":64,"n_cols":9,"rows_kept":64,"cut":false,"hidden":false,"merged":[]}
["v2\nI am____","​Required Kicks","​Required Patterns","​One step sparring/ grabs","Sparring","​Required breaks (# of boards/tiles can vary due to age, weight etc)","Cumulative competition experience (sparring or poomsae)","Min. time since last grading","Recommended number of classes"]
["White belt to yellow tip (people usually skip this and do the white belt to yellow belt grading)","Front kick, side kick","Right hand pattern, Left hand pattern"]
["White belt to Yellow","Front kick, side kick turning kick","Right hand",{"$nulls":5},10]
[null,null,"Left hand"]
[null,null,"Chon ji"]
[null,null,"Tuesday and Thursday students Taeguk 1 and chonji"]
[null,null,"NSGHS students: \nRight hand\nLeft hand\nChonji"]
["Yellow to Green tip","Above +",null,"​",null,null,"​","3 months",20]
[null,"Axe kick, crescent kick, back kick, reverse turning kick","chonji, Dan gun (yellow belt pattern)"]
[null,null,"Tuesday and Thursday students: Taeguk 1 and Chonji"]
[null,null,"NSGHS students:\nDan gun\nTaeguk 1\nChonji"]
["Green tip to Green","As above","Dan gun, Do San (green tip)","at least 3","Yes",null,null,"3 months",20]
[null,null,"Tuesday and Thursday students Taeguk 1 and 2"]
[null,null,"NSGHS students:\nDan gun, Do San\nTaeguk 1 and 2"]
["Green to Blue tip","​As above","Dan gun, Won Ho (green) ","at least 3","Yes","​",null,"3 months",20]
[null,null,"Tuesday and Thursday students taeguk 2 and 3"]
[null,null,"NSGHS students:\nDo San, Won Ho\nTaeguk 2 and 3"]
["Blue tip to Blue","​As above","Won ho, Yul Gok (blue tip) ","at least 4","Yes",null,"At least 1 competition (sparring and/or poomsae)","​3 months",20]
[null,null,"Tuesday and Thursday students Taeguk 3 and 4"]
[null,null,"NSGHS students:\nWon Ho, Yul Gok\nTaeguk 3 and 4"]
["Blue to Red tip","​As above","Yul gok\nJung Geun (blue)","at least 4","Yes",null,null,"​3 months",20]
[null,null,"Tuesday and Thursday students Taeguk 4 and 5"]
[null,null,"NSGHS students:\nYul gok, Jung Geun\nTaeguk 4 and 5"]
["Red tip to Red","​As above","Jung Geun, Toi Gye (red tip)","at least 5","Yes",null,null,"3 months",20]
[null,"+ crescent kick , spinning turning kick (tornado kick)","Tuesday and Thursday students Taeguk 5 and 6"]
[null,null,"NSGHS students\nJung Geun, Toi Gye\nTaeguk 5 and 6"]
["​Red to black tip","​As above","Toi Gye, Hwarang (red belt)","at least 5","Yes",null,"​At least 2 competitions (sparring and/or poomsae)","3 months",20]
[null,null,"Tuesday and Thursday students Taeguk 6 and 7"]
[null,null,"NSGHS students\nToi Gye, Hwarang\nTaeguk 6 and 7"]
["Black tip to Cho dan bo (Black belt)","​As above","Hwarang, Choong moo (black tip)","at least 6","Yes",null,null,"3 months",20]
[null,null,"Taeguk 1-4"]
[null,null,"Tuesday and Thursday students Taeguk 7 and 8 and yellow belt through to blue tip"]
["Cho dan bo to 1st Dan","As above","All previous patterns","at least 6","Yes","Flying side kick (3 people)",null,"6 months",60]
[null,null,"Jung Geun",null,null,"Turning kick 1 inch board"]
[null,null,"Toi Gye",null,null,"Side kick 1 inch board (1\")"]
[null,null,"Koryo",null,null,"Tiles "]
[null,null,"(Previous patterns drawn at random)"]
["1st dan to 2nd dan","As above","Kwang Gae","at least 6","​1v1","Head high jumping kick (your choice)","At least 3","1 year",120]
[null,null,"Po Eun ",null,"2v1","Flying side kick (3+ people)"]
[null,null,"Taeguk 5 to Koryo",null,null,"Turning kick 2”"]
[{"$nulls":5},"Side kick 2”"]
[{"$nulls":5},"Tiles"]
["2nd dan to 3rd dan","As above","All previous patterns +","at least 6","1v1","Double air break (your choice)",null,"2 years",240]
[null,null,"Gae bek",null,"At least 2v1","Flying side kick (3+ people)"]
[null,null,"Yoo Sin",null,null,"Turning kick (at least 2”. TBC by examiner)"]
[null,null,"Keumgang",null,null,"Side kick (at least 2”. TBC by examiner)"]
[null,null,"(Previous patterns drawn at random)",null,null,"Tiles"]
["3rd dan to 4th dan","As above","All previous patterns +","at least 6","1v1","At least double air break ( # TBC by examiner)","At least 4 competitions (sparring or poomsae)","3 years",320]
[null,null,"Choong jang",null,"At least 2v1","Flying side kick (3+ people)"]
[null,null,"Ul Ji",null,null,"Turning kick (at least 2”. TBC by examiner)"]
[null,null,"Taebaek",null,null,"Side kick (at least 2”. TBC by examiner)"]
[null,null,"(Previous patterns drawn at random)",null,null,"Tiles"]
["4th - 5th dan","​As above","All previous patterns +","at least 6","1v1","​At least double air break ( # TBC by examiner)",null,"4 years",400]
[null,null,"Pyongwon"]
[null,null,"Sipjin. ",null,"At least 2v1","Flying side kick (3+ people)"]
[null,null,"(Previous patterns drawn at random)",null,null,"Turning kick (at least 2”. TBC by examiner)"]
[{"$nulls":5},"Side kick (at least 2”. TBC by examiner)"]
[{"$nulls":5},"Tiles"]
["4th - 5th dan","​As above","All previous patterns +","at least 6","1v1","​At least double air break ( # TBC by examiner)",null,"4 years",400]
[null,null,"Pyongwon"]
[null,null,"Sipjin. ",null,"At least 2v1","Flying side kick (3+ people)"]
[null,null,"(Previous patterns drawn at random)",null,null,"Turning kick (at least 2”. TBC by examiner)"]
[{"$nulls":5},"Side kick (at least 2”. TBC by examiner)"]
[{"$nulls":5},"Tiles"]

{"sheet":"Sheet4","index":2,"n_rows":16,"n_cols":10,"rows_kept":16,"cut":false,"hidden":true,"merged":[]}
["Current grade","​Required Kicks","​Required Patterns","Tuesday/Thursday patters","nsghs patterns","​One step sparring/ grabs","Sparring","​Required breaks (# of boards/tiles can vary due to age, weight etc)","Cumulative competition experience (sparring or poomsae)","Min. time since last grading"]
["White belt (10th kup)","Front Kick\nTurning Kick\nSide Kick","Right hand pattern\nLeft hand pattern\nChon ji","Chonji\nTaeguk 1","Right hand pattern\nLeft hand pattern\nChonji\n","N/A","N/A","N/A","N/A",0]
["Yellow Tip (9th kup)","Front Kick\nTurning Kick\nSide Kick","Right hand pattern\nLeft hand pattern\nChon ji","Chonji\nTaeguk 1","Right hand pattern\nLeft hand pattern\nChonji\nTaeguk 1","N/A","N/A","N/A","N/A",0]
["Yellow Belt (8th kup)","Front Kick\nTurning Kick\nSide Kick\nAxe Kick\nBack Kick\nReverse Turning Kick","Chon ji\nDan gun (yellow belt pattern)","Taeguk 1 \nChon Ji","Dan gun (yellow belt pattern)\nChon ji\nTaeguk 1\n",null,"N/A","N/A","N/A",83]
["Green Tip (7th kup)","Front Kick\nTurning Kick\nSide Kick\nAxe Kick\nBack Kick\nReverse Turning Kick","Dan gun (yellow belt pattern)\nDo San (green tip)\n","Taeguk 1 \nTaeguk 2","Dan gun (yellow belt pattern)\nDo San (green tip)\nTaeguk 1 \nTaeguk 2","At least 3","Yes","N/A","N/A",83]
["Green Belt (6th kup)","Front Kick\nTurning Kick\nSide Kick\nAxe Kick\nCrescent Kick\nBack Kick\nReverse Turning Kick","Do San (green tip)\nWon Ho (green belt) ","Taeguk 2\nTaeguk 3","Do San (green tip)\nWon Ho (green belt) \nTaeguk 2\nTaeguk 3","At least 3","Yes","N/A","N/A",83]
["Blue Tip (5th kup)","Front Kick\nTurning Kick\nSide Kick\nAxe Kick\nCrescent Kick\nBack Kick\nReverse Turning Kick","Won ho (green belt)\nYul Gok (blue tip) ","Taeguk 3 \nTaeguk 4","Won ho (green belt)\nYul Gok (blue tip) \nTaeguk 3 \nTaeguk 4","At least 4","Yes","N/A",1,83]
["Blue Belt (4th kup)","Front Kick\nTurning Kick\nSide Kick\nAxe Kick\nCrescent Kick\nBack Kick\nReverse Turning Kick","Yul gok (blue tip)\nJung Geun (blue)","Taeguk 4 \nTaeguk 5","Yul gok (blue tip)\nJung Geun (blue)\nTaeguk 4 \nTaeguk 5","At least 4","Yes","N/A",1,83]
["Red Tip (3rd kup)","Front Kick\nTurning Kick\nSide Kick\nAxe Kick\nCrescent Kick\nBack Kick\nReverse Turning Kick\nSpinning Turning Kick","Jung Geun (Blue belt)\nToi Gye (red tip)","Taeguk 5 \nTaeguk 6","Jung Geun (blue belt)\nToi Gye (red tip)\nTaeguk 5 \nTaeguk 6","At least 5","Yes","N/A",1,83]
["Red Belt (2nd kup)","Front Kick\nTurning Kick\nSide Kick\nAxe Kick\nCrescent Kick\nBack Kick\nReverse Turning Kick\nSpinning Turning Kick","Toi Gye (red tip)\nHwarang (red belt)\nTaeguk 1\nTaeguk 2","Taeguk 6 \nTaeguk 7\nDan gun (yellow belt pattern)\nDo San (green tip)","Toi Gye (red tip)\nHwarang (red belt)\nTaeguk 6 \nTaeguk 7","At least 5","Yes","N/A",2,83]
["Black tip (1st kup)","Front Kick\nTurning Kick\nSide Kick\nAxe Kick\nCrescent Kick\nBack Kick\nReverse Turning Kick\nSpinning Turning Kick","Hwarang\nChoong moo (black tip)\nTaeguk 1 to\nTaeguk 4","Taeguk 7\nTaeguk 8\nYellow belt - blue tip","Hwarang (red belt)\nChoong moo (black tip)\nTaeguk 7\nTaeguk 8","At least 6","Yes","N/A",2,83]
["Black Belt (Cho dan)","Front Kick\nTurning Kick\nSide Kick\nAxe Kick\nCrescent Kick\nBack Kick\nReverse Turning Kick\nSpinning Turning Kick","Randomly chosen pattern 1\nRandomly chosen pattern 2\nJung Geun (Blue belt)\nToi Gye (Red Tip)\nKoryo","Randomly chosen pattern 1\nRandomly chosen pattern 2\nJung Geun (Blue belt)\nToi Gye (Red Tip)\nKoryo\n","Randomly chosen pattern 1\nRandomly chosen pattern 2\nJung Geun (Blue belt)\nToi Gye (Red Tip)\nKoryo\n","At least 6","Yes","Flying side kick (3 people)\nSide kick 1 inch board (1\")\nTurning kick 1 inch board (1\")\nTiles",2,170]
["1st Dan/poom","Front Kick\nTurning Kick\nSide Kick\nAxe Kick\nCrescent Kick\nBack Kick\nReverse Turning Kick\nSpinning Turning Kick","Kwang Gae (Black Belt)\nPo Eun (1st dan)\nTaeguk 5 to Koryo\n","Kwang Gae (Black Belt)\nPo Eun (1st dan)\nTaeguk 5 to Koryo\n","Kwang Gae (Black Belt)\nPo Eun (1st dan)\nTaeguk 5 to Koryo\n","At least 6","1vs1\n2vs1","Head high jumping kick (your choice of kick)\nFlying side kick (3 people)\nSide kick 2 inch board (2\")\nTurning kick 2 inch board (2\")\nTiles",3,355]
["2nd Dan/poom","Front Kick\nTurning Kick\nSide Kick\nAxe Kick\nCrescent Kick\nBack Kick\nReverse Turning Kick\nSpinning Turning Kick","Randomly chosen pattern 1\nRandomly chosen pattern 2\nRandomly chosen pattern 3\nRandomly chosen pattern 4\nGae bek\nYoo Sin\nKeumgang\n\n","Randomly chosen pattern 1\nRandomly chosen pattern 2\nRandomly chosen pattern 3\nRandomly chosen pattern 4\nGae bek (Second dan 1)\nYoo Sin (Second dan 2)\nKeumgang\n(Previous patterns drawn at random)\n","Randomly chosen pattern 1\nRandomly chosen pattern 2\nRandomly chosen pattern 3\nRandomly chosen pattern 4\nGae bek (Second dan 1)\nYoo Sin (Second dan 2)\nKeumgang\n(Previous patterns drawn at random)\n","At least 6","1vs1\nAt least 2vs1","Double air break (your choice of kick)\nFlying side kick (3 people)\nSide kick at least 2 inch board (2\")\nTurning kick at least 2 inch board (2\")\nTiles",3,710]
["3rd Dan/poom","Front Kick\nTurning Kick\nSide Kick\nAxe Kick\nCrescent Kick\nBack Kick\nReverse Turning Kick\nSpinning Turning Kick","Randomly chosen pattern 1\nRandomly chosen pattern 2\nRandomly chosen pattern 3\nRandomly chosen pattern 4\nRandomly chosen pattern 5\nRandomly chosen pattern 6\nRandomly chosen pattern 7\nRandomly chosen pattern 8\nChoong jang (3rd dan 1)\nUl Ji (3rd dan 2)\nTaebaek","Randomly chosen pattern 1\nRandomly chosen pattern 2\nRandomly chosen pattern 3\nRandomly chosen pattern 4\nRandomly chosen pattern 5\nRandomly chosen pattern 6\nRandomly chosen pattern 7\nRandomly chosen pattern 8\nChoong jang (3rd dan 1)\nUl Ji (3rd dan 2)\nTaebaek","Randomly chosen pattern 1\nRandomly chosen pattern 2\nRandomly chosen pattern 3\nRandomly chosen pattern 4\nRandomly chosen pattern 5\nRandomly chosen pattern 6\nRandomly chosen pattern 7\nRandomly chosen pattern 8\nChoong jang (3rd dan 1)\nUl Ji (3rd dan 2)\nTaebaek","At least 6","1vs1\nAt least 2vs1","At least double air break (your choice of kick)\nFlying side kick (3 people)\nSide kick at least 2 inch board (2\")\nTurning kick at least 2 inch board (2\")\nTiles",4,1070]
["4th Dan","Front Kick\nTurning Kick\nSide Kick\nAxe Kick\nCrescent Kick\nBack Kick\nReverse Turning Kick\nSpinning Turning Kick","Randomly chosen pattern 1\nRandomly chosen pattern 2\nRandomly chosen pattern 3\nRandomly chosen pattern 4\nRandomly chosen pattern 5\nRandomly chosen pattern 6\nRandomly chosen pattern 7\nRandomly chosen pattern 8\nRandomly chosen pattern 9\nRandomly chosen pattern 10\nPyongwon\nSipjin","Randomly chosen pattern 1\nRandomly chosen pattern 2\nRandomly chosen pattern 3\nRandomly chosen pattern 4\nRandomly chosen pattern 5\nRandomly chosen pattern 6\nRandomly chosen pattern 7\nRandomly chosen pattern 8\nRandomly chosen pattern 9\nRandomly chosen pattern 10\nPyongwon\nSipjin","Randomly chosen pattern 1\nRandomly chosen pattern 2\nRandomly chosen pattern 3\nRandomly chosen pattern 4\nRandomly chosen pattern 5\nRandomly chosen pattern 6\nRandomly chosen pattern 7\nRandomly chosen pattern 8\nRandomly chosen pattern 9\nRandomly chosen pattern 10\nPyongwon\nSipjin","At least 6","1vs1\nAt least 2vs1","At least double air break (your choice of kick)\nFlying side kick (3 people)\nSide kick at least 2 inch board (2\")\nTurning kick at least 2 inch board (2\")\nTiles",4,{"$f":"(4*360)-10","v":1430}]

{"sheet":"Sheet5","index":3,"n_rows":16,"n_cols":1,"rows_kept":16,"cut":false,"hidden":true,"merged":[]}
["Chon ji"]
["Dan gun (yellow belt pattern)"]
["Do San (green tip)"]
["Won Ho (green belt) "]
["Yul Gok (blue tip) "]
["Dan gun (yellow belt pattern)"]
[]
["Beacon Hill"]
["Chatswood Tuesday"]
["Chatswood Thursday"]
["Chatswood Saturday"]
["Lindfield"]
["Manly"]
["Mosman"]
["North Sydney Girls High/North Sydney Boys High"]
["Willoughby"]